BDBM65871 5-bromanyl-N-(1-phenylethyl)thiophene-2-sulfonamide::5-bromo-N-(1-phenylethyl)-2-thiophenesulfonamide::5-bromo-N-(1-phenylethyl)thiophene-2-sulfonamide::MLS001197733::SMR000559803::cid_2942461
SMILES CC(NS(=O)(=O)c1ccc(Br)s1)c1ccccc1
InChI Key InChIKey=NURPASYGVRKHGU-UHFFFAOYSA-N
Data  1 IC50
  Tab Delimited (TSV)   2D SDfile   Computed 3D by Vconf -m prep SDfile
Find this compound or compounds like it in BindingDB:
Activity Spreadsheet -- Enzyme Inhibition Constant Data from BindingDB
Found 1 hit for monomerid = 65871
TargetInward rectifier potassium channel 2(Mus musculus)
Johns Hopkins Ion Channel Center
Curated by PubChem BioAssay
LigandPNGBDBM65871(5-bromanyl-N-(1-phenylethyl)thiophene-2-sulfonamid...)
Affinity DataIC50:  1.98E+4nM. Assay description: Data Source: Johns Hopkins Ion Channel Center (JHICC) BioAssay Type: Confirmatory, Confirmatory Screening, Multiple Concentration Activity Observed. ...
In DepthDetails PCBioAssay