BDBM66978 (E)-3-(4-bromophenyl)-N,N-dimethyl-3-(3-pyridinyl)-2-propen-1-amine;hydrate;hydrochloride::(E)-3-(4-bromophenyl)-N,N-dimethyl-3-pyridin-3-yl-prop-2-en-1-amine;hydrate;hydrochloride::(E)-3-(4-bromophenyl)-N,N-dimethyl-3-pyridin-3-ylprop-2-en-1-amine;hydrate;hydrochloride::MLS002154197::SMR001233484::Zimelidine (E-isomer)::Zimelidine (Z-isomer)::Zimelidine dihydrochloride monohydrate::[(E)-3-(4-bromophenyl)-3-(3-pyridyl)allyl]-dimethyl-amine;hydrate;hydrochloride::cid_24871308
SMILES CN(C)C\C=C(/c1ccc(Br)cc1)c1cccnc1
InChI Key InChIKey=OYPPVKRFBIWMSX-CXUHLZMHSA-N
Data  2 KI  2 IC50  1 EC50
  Tab Delimited (TSV)   2D SDfile   Computed 3D by Vconf -m prep SDfile
Find this compound or compounds like it in BindingDB:
Activity Spreadsheet -- Enzyme Inhibition Constant Data from BindingDB
Found 5 hits for monomerid = 66978
TargetSodium-dependent serotonin transporter(Rattus norvegicus (rat))
Veterans Administration Medical Center
Curated by PDSP Ki Database
LigandPNGBDBM66978((E)-3-(4-bromophenyl)-N,N-dimethyl-3-(3-pyridinyl)...)
Affinity DataKi:  77.8nM
In DepthDetails ArticlePubMed
TargetSodium-dependent serotonin transporter(Rattus norvegicus (rat))
Veterans Administration Medical Center
Curated by PDSP Ki Database
LigandPNGBDBM66978((E)-3-(4-bromophenyl)-N,N-dimethyl-3-(3-pyridinyl)...)
Affinity DataKi:  2.28E+3nM
In DepthDetails ArticlePubMed
TargetSodium-dependent serotonin transporter(Rattus norvegicus (rat))
Veterans Administration Medical Center
Curated by PDSP Ki Database
LigandPNGBDBM66978((E)-3-(4-bromophenyl)-N,N-dimethyl-3-(3-pyridinyl)...)
Affinity DataIC50:  1.70E+3nM. Assay description: In vitro inhibition of accumulation of [14C]-5-HT (5-HT) in mouse brain slices
In DepthDetails ArticlePubMed
TargetTransporter(Rattus norvegicus)
TBA
Curated by ChEMBL
LigandPNGBDBM66978((E)-3-(4-bromophenyl)-N,N-dimethyl-3-(3-pyridinyl)...)
Affinity DataIC50:  2.40E+4nM. Assay description: In vitro inhibition of accumulation of (-)-[3H]-Norepinephrine (NA) in mouse brain slices
In DepthDetails ArticlePubMed
TargetBcl-2-like protein 11(Homo sapiens (Human))
Broad Institute
Curated by PubChem BioAssay
LigandPNGBDBM66978((E)-3-(4-bromophenyl)-N,N-dimethyl-3-(3-pyridinyl)...)
Affinity DataEC50: >3.50E+5nM. Assay description: Keywords: apoptosis, BH3 domain, Bcl2-A1, BIM, caspase, cancer Primary Collaborator: Todd Golub, Broad Institute, golub@broadinstitute.org Assay Over...
In DepthDetails PCBioAssay