BDBM67082 2-(3-pyrrolidin-1-ylsulfonylanilino)-N-[3-(trifluoromethyl)phenyl]acetamide::2-(3-pyrrolidinosulfonylanilino)-N-[3-(trifluoromethyl)phenyl]acetamide::2-[(3-pyrrolidin-1-ylsulfonylphenyl)amino]-N-[3-(trifluoromethyl)phenyl]ethanamide::2-[3-(1-pyrrolidinylsulfonyl)anilino]-N-[3-(trifluoromethyl)phenyl]acetamide::MLS002249325::SMR001316761::cid_5131095
SMILES FC(F)(F)c1cccc(NC(=O)CNc2cccc(c2)S(=O)(=O)N2CCCC2)c1
InChI Key InChIKey=RNYHOBHVJHIJMF-UHFFFAOYSA-N
Data  1 EC50
  Tab Delimited (TSV)   2D SDfile   Computed 3D by Vconf -m prep SDfile
Find this compound or compounds like it in BindingDB:
Activity Spreadsheet -- Enzyme Inhibition Constant Data from BindingDB
Found 1 hit for monomerid = 67082
TargetBcl-2-like protein 11(Homo sapiens (Human))
Broad Institute
Curated by PubChem BioAssay
LigandPNGBDBM67082(2-(3-pyrrolidin-1-ylsulfonylanilino)-N-[3-(trifluo...)
Affinity DataEC50: >3.50E+5nM. Assay description: Keywords: apoptosis, BH3 domain, Bcl2-A1, BIM, caspase, cancer Primary Collaborator: Todd Golub, Broad Institute, golub@broadinstitute.org Assay Over...
In DepthDetails PCBioAssay