BDBM67293 2-pyrazinecarboxylic acid [2-(3-nitrophenyl)-2-oxoethyl] ester::MLS001044415::Pyrazine-2-carboxylic acid 2-(3-nitro-phenyl)-2-oxo-ethyl ester::SMR000424786::[2-(3-nitrophenyl)-2-oxidanylidene-ethyl] pyrazine-2-carboxylate::[2-(3-nitrophenyl)-2-oxoethyl] pyrazine-2-carboxylate::cid_929469::pyrazinic acid [2-keto-2-(3-nitrophenyl)ethyl] ester
SMILES [O-][N+](=O)c1cccc(c1)C(=O)COC(=O)c1cnccn1
InChI Key InChIKey=JXZVNENWRPQYLH-UHFFFAOYSA-N
Data  2 IC50
  Tab Delimited (TSV)   2D SDfile   Computed 3D by Vconf -m prep SDfile
Find this compound or compounds like it in BindingDB:
Activity Spreadsheet -- Enzyme Inhibition Constant Data from BindingDB
Found 1 hit for monomerid = 67293
TargetType-1 angiotensin II receptor(Homo sapiens (Human))
Burnham Center For Chemical Genomics
Curated by PubChem BioAssay
LigandPNGBDBM67293(2-pyrazinecarboxylic acid [2-(3-nitrophenyl)-2-oxo...)
Affinity DataIC50:  1.36E+4nM. Assay description: Data Source: Sanford-Burnham Center for Chemical Genomics (SBCCG) Source Affiliation: Sanford-Burnham Medical Research Institute(SBMRI, San Diego, C...
In DepthDetails PCBioAssay