BDBM69052 2-(4-besylpiperazino)-N-(4-nitrophenyl)acetamide::2-[4-(benzenesulfonyl)-1-piperazinyl]-N-(4-nitrophenyl)acetamide::2-[4-(benzenesulfonyl)piperazin-1-yl]-N-(4-nitrophenyl)acetamide::MLS000394331::N-(4-nitrophenyl)-2-[4-(phenylsulfonyl)piperazin-1-yl]ethanamide::SMR000248279::cid_15945386
SMILES [O-][N+](=O)c1ccc(NC(=O)CN2CCN(CC2)S(=O)(=O)c2ccccc2)cc1
InChI Key InChIKey=RSRHPJYSALPETK-UHFFFAOYSA-N
Data  1 EC50
  Tab Delimited (TSV)   2D SDfile   Computed 3D by Vconf -m prep SDfile
Find this compound or compounds like it in BindingDB:
Activity Spreadsheet -- Enzyme Inhibition Constant Data from BindingDB
Found 1 hit for monomerid = 69052
TargetGlycogen synthase kinase-3 beta(Homo sapiens (Human))
Broad Institute
Curated by PubChem BioAssay
LigandPNGBDBM69052(2-(4-besylpiperazino)-N-(4-nitrophenyl)acetamide |...)
Affinity DataEC50: >3.00E+5nM. Assay description: Keywords: GSK3beta, dose response, kinase, inhibition, HTS Assay Overview: The glycogen synthase kinase-3 beta (GSK-3b) is a known master regulator f...
In DepthDetails PCBioAssay