BDBM7691 4-[N¢-(4-Isopropyl-2-oxo-1,2-dihydro-indol-3-ylidene)-hydrazino]benzenesulfonamide::4-{2-[(3Z)-2-oxo-4-(propan-2-yl)-2,3-dihydro-1H-indol-3-ylidene]hydrazin-1-yl}benzene-1-sulfonamide::Oxindole-Based Inhibitor 27
SMILES CC(C)c1cccc2NC(=O)C(=NNc3ccc(cc3)S(N)(=O)=O)c12
InChI Key InChIKey=JPHSILBVVGFZAR-UHFFFAOYSA-N
Data  5 IC50
  Tab Delimited (TSV)   2D SDfile   Computed 3D by Vconf -m prep SDfile
Find this compound or compounds like it in BindingDB:
Activity Spreadsheet -- Enzyme Inhibition Constant Data from BindingDB
Found 5 hits for monomerid = 7691
TargetCyclin-dependent kinase/G2/mitotic-specific cyclin- 1(Homo sapiens (Human))
Glaxosmithkline
LigandPNGBDBM7691(4-[N¢-(4-Isopropyl-2-oxo-1,2-dihydro-indol-3-ylid...)
Affinity DataIC50:  37nMpH: 7.5 T: 2°C. Assay description: The biochemical activity of compounds was determined by incubation with specific enzymes and substrates in the presence 1.4 uM ATP/[gamma-32P] ATP. A...
In DepthDetails ArticlePubMed
TargetCyclin-A2/Cyclin-dependent kinase 2(Homo sapiens (Human))
Glaxosmithkline
LigandPNGBDBM7691(4-[N¢-(4-Isopropyl-2-oxo-1,2-dihydro-indol-3-ylid...)
Affinity DataIC50:  2.5nM. Assay description: The biochemical activity of compounds was determined by incubation with specific enzymes and substrates in the presence 1.4 uM ATP/[gamma-32P] ATP. A...
In DepthDetails ArticlePubMed
TargetCyclin-dependent kinase 2(Homo sapiens (Human))
University Of Zurich
Curated by ChEMBL
LigandPNGBDBM7691(4-[N¢-(4-Isopropyl-2-oxo-1,2-dihydro-indol-3-ylid...)
Affinity DataIC50:  2.5nM. Assay description: Inhibition of CDK2
In DepthDetails ArticlePubMed
TargetCyclin-dependent kinase 2(Homo sapiens (Human))
University Of Zurich
Curated by ChEMBL
LigandPNGBDBM7691(4-[N¢-(4-Isopropyl-2-oxo-1,2-dihydro-indol-3-ylid...)
Affinity DataIC50:  2.5nM. Assay description: Evaluated for inhibition of human cyclin dependent kinase 2
In DepthDetails ArticlePubMed
TargetCyclin-dependent kinase 1(Homo sapiens (Human))
University Of Zurich
Curated by ChEMBL
LigandPNGBDBM7691(4-[N¢-(4-Isopropyl-2-oxo-1,2-dihydro-indol-3-ylid...)
Affinity DataIC50:  37nM. Assay description: Inhibition of CDK1
In DepthDetails ArticlePubMed