BDBM7696 4-[N -(2-Oxo-4-phenoxy-1,2-dihydro-indol-3-ylidene)-hydrazino]benzenesulfonamide::4-{2-[(3Z)-2-oxo-4-phenoxy-2,3-dihydro-1H-indol-3-ylidene]hydrazin-1-yl}benzene-1-sulfonamide::Oxindole-Based Inhibitor 32
SMILES NS(=O)(=O)c1ccc(NN=C2C(=O)Nc3cccc(Oc4ccccc4)c23)cc1
InChI Key InChIKey=WOUDREXVBSUATL-UHFFFAOYSA-N
Data  5 IC50
  Tab Delimited (TSV)   2D SDfile   Computed 3D by Vconf -m prep SDfile
Find this compound or compounds like it in BindingDB:
Activity Spreadsheet -- Enzyme Inhibition Constant Data from BindingDB
Found 5 hits for monomerid = 7696
TargetCyclin-dependent kinase/G2/mitotic-specific cyclin- 1(Homo sapiens (Human))
Glaxosmithkline
LigandPNGBDBM7696(4-[N -(2-Oxo-4-phenoxy-1,2-dihydro-indol-3-ylidene...)
Affinity DataIC50:  290nM. Assay description: The biochemical activity of compounds was determined by incubation with specific enzymes and substrates in the presence 1.4 uM ATP/[gamma-32P] ATP. A...
In DepthDetails ArticlePubMed
TargetCyclin-A2/Cyclin-dependent kinase 2(Homo sapiens (Human))
Glaxosmithkline
LigandPNGBDBM7696(4-[N -(2-Oxo-4-phenoxy-1,2-dihydro-indol-3-ylidene...)
Affinity DataIC50:  13nM. Assay description: The biochemical activity of compounds was determined by incubation with specific enzymes and substrates in the presence 1.4 uM ATP/[gamma-32P] ATP. A...
In DepthDetails ArticlePubMed
TargetCyclin-dependent kinase 2(Homo sapiens (Human))
University Of Zurich
Curated by ChEMBL
LigandPNGBDBM7696(4-[N -(2-Oxo-4-phenoxy-1,2-dihydro-indol-3-ylidene...)
Affinity DataIC50:  13nM. Assay description: Inhibition of CDK2
In DepthDetails ArticlePubMed
TargetCyclin-dependent kinase 2(Homo sapiens (Human))
University Of Zurich
Curated by ChEMBL
LigandPNGBDBM7696(4-[N -(2-Oxo-4-phenoxy-1,2-dihydro-indol-3-ylidene...)
Affinity DataIC50:  13nM. Assay description: Evaluated for inhibition of human cyclin dependent kinase 2
In DepthDetails ArticlePubMed
TargetCyclin-dependent kinase 1(Homo sapiens (Human))
University Of Zurich
Curated by ChEMBL
LigandPNGBDBM7696(4-[N -(2-Oxo-4-phenoxy-1,2-dihydro-indol-3-ylidene...)
Affinity DataIC50:  290nM. Assay description: Inhibition of CDK1
In DepthDetails ArticlePubMed