BDBM76972 MLS000051999::N-cyclohexyl-3,4-dimethoxy-N-[[3-(4-methylphenyl)-1,2,4-oxadiazol-5-yl]methyl]benzamide::N-cyclohexyl-3,4-dimethoxy-N-[[3-(p-tolyl)-1,2,4-oxadiazol-5-yl]methyl]benzamide::N-cyclohexyl-3,4-dimethoxy-N-{[3-(4-methylphenyl)-1,2,4-oxadiazol-5-yl]methyl}benzamide::SMR000081253::cid_1250348
SMILES COc1ccc(cc1OC)C(=O)N(Cc1nc(no1)-c1ccc(C)cc1)C1CCCCC1
InChI Key InChIKey=OZXGWVJEOJGCGS-UHFFFAOYSA-N
Data  1 EC50
  Tab Delimited (TSV)   2D SDfile   Computed 3D by Vconf -m prep SDfile
Find this compound or compounds like it in BindingDB:
Activity Spreadsheet -- Enzyme Inhibition Constant Data from BindingDB
Found 1 hit for monomerid = 76972
TargetVoltage-dependent T-type calcium channel subunit alpha-1H(Homo sapiens (Human))
Vanderbilt Screening Center For Gpcrs, Ion Channels and Transporters
Curated by PubChem BioAssay
LigandPNGBDBM76972(MLS000051999 | N-cyclohexyl-3,4-dimethoxy-N-[[3-(4...)
Affinity DataEC50:  8.02E+3nM. Assay description: Assay Provider: Xinmin Xie Assay Provider Affiliation: Bioscience Division, SRI International, Menlo Park, CA Grant Title: HTS Assay for Cav3 T-Type ...
In DepthDetails PCBioAssay