BDBM7724 (3Z)-2-oxo-N-(pyridin-4-ylmethyl)-3-[2-(4-sulfamoylphenyl)hydrazin-1-ylidene]-2,3-dihydro-1H-indole-5-carboxamide::3-{[4-(Aminosulfonyl)phenyl]hydrazono}-2-oxo-N-(4-pyridinylmethyl)-2,3-dihydro-1H-indole-5-carboxamide::Oxindole-Based Inhibitor 60
SMILES NS(=O)(=O)c1ccc(NN=C2C(=O)Nc3ccc(cc23)C(=O)NCc2ccncc2)cc1
InChI Key InChIKey=TTYSGEABGJKUIS-UHFFFAOYSA-N
Data  5 IC50
  Tab Delimited (TSV)   2D SDfile   Computed 3D by Vconf -m prep SDfile
Find this compound or compounds like it in BindingDB:
Activity Spreadsheet -- Enzyme Inhibition Constant Data from BindingDB
Found 5 hits for monomerid = 7724
TargetCyclin-dependent kinase/G2/mitotic-specific cyclin- 1(Homo sapiens (Human))
Glaxosmithkline
LigandPNGBDBM7724((3Z)-2-oxo-N-(pyridin-4-ylmethyl)-3-[2-(4-sulfamoy...)
Affinity DataIC50:  74nM. Assay description: The biochemical activity of compounds was determined by incubation with specific enzymes and substrates in the presence 1.4 uM ATP/[gamma-32P] ATP. A...
In DepthDetails ArticlePubMed
TargetCyclin-A2/Cyclin-dependent kinase 2(Homo sapiens (Human))
Glaxosmithkline
LigandPNGBDBM7724((3Z)-2-oxo-N-(pyridin-4-ylmethyl)-3-[2-(4-sulfamoy...)
Affinity DataIC50:  8.90nM. Assay description: The biochemical activity of compounds was determined by incubation with specific enzymes and substrates in the presence 1.4 uM ATP/[gamma-32P] ATP. A...
In DepthDetails ArticlePubMed
TargetCyclin-dependent kinase 2(Homo sapiens (Human))
University Of Zurich
Curated by ChEMBL
LigandPNGBDBM7724((3Z)-2-oxo-N-(pyridin-4-ylmethyl)-3-[2-(4-sulfamoy...)
Affinity DataIC50:  8.90nM. Assay description: Inhibition of CDK2
In DepthDetails ArticlePubMed
TargetCyclin-dependent kinase 2(Homo sapiens (Human))
University Of Zurich
Curated by ChEMBL
LigandPNGBDBM7724((3Z)-2-oxo-N-(pyridin-4-ylmethyl)-3-[2-(4-sulfamoy...)
Affinity DataIC50:  8.90nM. Assay description: Evaluated for inhibition of human cyclin dependent kinase 2
In DepthDetails ArticlePubMed
TargetCyclin-dependent kinase 1(Homo sapiens (Human))
University Of Zurich
Curated by ChEMBL
LigandPNGBDBM7724((3Z)-2-oxo-N-(pyridin-4-ylmethyl)-3-[2-(4-sulfamoy...)
Affinity DataIC50:  74nM. Assay description: Inhibition of CDK1
In DepthDetails ArticlePubMed