BDBM78782 4-[1-[(3-fluorophenyl)methyl]-2,4-bis(oxidanylidene)quinazolin-3-yl]-N-[1-(phenylmethyl)piperidin-4-yl]butanamide::4-[1-[(3-fluorophenyl)methyl]-2,4-dioxo-3-quinazolinyl]-N-[1-(phenylmethyl)-4-piperidinyl]butanamide::MLS000730457::N-(1-benzyl-4-piperidyl)-4-[1-(3-fluorobenzyl)-2,4-diketo-quinazolin-3-yl]butyramide::N-(1-benzylpiperidin-4-yl)-4-[1-(3-fluorobenzyl)-2,4-dioxo-1,4-dihydroquinazolin-3(2H)-yl]butanamide::N-(1-benzylpiperidin-4-yl)-4-[1-[(3-fluorophenyl)methyl]-2,4-dioxoquinazolin-3-yl]butanamide::SMR000308733::cid_16193615
SMILES Fc1cccc(Cn2c3ccccc3c(=O)n(CCCC(=O)NC3CCN(Cc4ccccc4)CC3)c2=O)c1
InChI Key InChIKey=XYTXFNCNPOAWMP-UHFFFAOYSA-N
Data  3 IC50
  Tab Delimited (TSV)   2D SDfile   Computed 3D by Vconf -m prep SDfile
Find this compound or compounds like it in BindingDB:
Activity Spreadsheet -- Enzyme Inhibition Constant Data from BindingDB
Found 1 hit for monomerid = 78782
TargetUbiquitin-conjugating enzyme E2 N(Homo sapiens (Human))
Burnham Center For Chemical Genomics
Curated by PubChem BioAssay
LigandPNGBDBM78782(4-[1-[(3-fluorophenyl)methyl]-2,4-bis(oxidanyliden...)
Affinity DataIC50:  2.11E+3nM. Assay description: Data Source: Sanford-Burnham Center for Chemical Genomics (SBCCG) Source Affiliation: Sanford-Burnham Medical Research Institute (SBMRI, San Diego CA...
In DepthDetails PCBioAssay