BDBM81310 Azole, 3
SMILES Clc1ccc(C(Cn2ccnc2)NC(=O)c2nnc(o2)-c2ccccc2)c(Cl)c1
InChI Key InChIKey=NSKDTGKRJIKUPO-UHFFFAOYSA-N
Data  2 Kd
  Tab Delimited (TSV)   2D SDfile   Computed 3D by Vconf -m prep SDfile
Find this compound or compounds like it in BindingDB:
Activity Spreadsheet -- Enzyme Inhibition Constant Data from BindingDB
Found 2 hits for monomerid = 81310
TargetLanosterol 14-alpha-demethylase(Trypanosoma brucei)
Vanderbilt University
LigandPNGBDBM81310(Azole, 3)
Affinity DataKd:  140nMpH: 6.0Assay Description:Azole derivatives used as an inhibitor of TB and TC CYP51.
In DepthDetails ArticlePubMed
TargetSterol 14-alpha demethylase(Trypanosoma cruzi)
Vanderbilt University
LigandPNGBDBM81310(Azole, 3)
Affinity DataKd:  140nMpH: 6.0Assay Description:Azole derivatives used as an inhibitor of TB and TC CYP51.
In DepthDetails ArticlePubMed