BDBM81331 MeGTP (6b)
SMILES COc1nc2c(nc(N)[nH]c2=O)n1[C@@H]1O[C@H](COP([O-])(=O)OP([O-])(=O)OP(O)([O-])=O)C(O)C1O
InChI Key InChIKey=ASABXRLJRLSUPF-VKJDSPIKSA-K
Data  2 IC50  1 Kd
  Tab Delimited (TSV)   2D SDfile   Computed 3D by Vconf -m prep SDfile
Find this compound or compounds like it in BindingDB:
Activity Spreadsheet -- Enzyme Inhibition Constant Data from BindingDB
Found 2 hits for monomerid = 81331
TargetCell division protein FtsZ(Aquifex aeolicus)
University of Amsterdam
LigandPNGBDBM81331(MeGTP (6b))
Affinity DataIC50:  1.53E+4nMpH: 7.5Assay Description:The binding affinities to FtsZ were determined by a fluorescent coupled assay for phosphate relase. In this GTPase studies, phosphate liberated durin...
In DepthDetails ArticlePubMed
TargetCell division protein FtsZ(Aquifex aeolicus)
University of Amsterdam
LigandPNGBDBM81331(MeGTP (6b))
Affinity DataIC50:  1.00E+4nM Kd:  3.33nMpH: 7.5Assay Description:The binding affinities to FtsZ were determined by a fluorescent competition assay with 2'/3'-O-(N-methyl-anthraniloyl)-guanosine-5'-triph...
In DepthDetails ArticlePubMed