BDBM81448 CAS_5560-72-5::IPRINDOLE::NSC_21722
SMILES CN(C)CCCn1c2CCCCCCc2c2ccccc12
InChI Key InChIKey=PLIGPBGDXASWPX-UHFFFAOYSA-N
Data  10 KI
  Tab Delimited (TSV)   2D SDfile   Computed 3D by Vconf -m prep SDfile
Find this compound or compounds like it in BindingDB:
Activity Spreadsheet -- Enzyme Inhibition Constant Data from BindingDB
Found 10 hits for monomerid = 81448
TargetHistamine H1 receptor(RAT)
TBA
Curated by PDSP Ki Database
LigandPNGBDBM81448(CAS_5560-72-5 | IPRINDOLE | NSC_21722)
Affinity DataKi:  100nM
In DepthDetails ArticlePubMed
TargetHistamine H1 receptor(Homo sapiens (Human))
Mayo Foundation
Curated by PDSP Ki Database
LigandPNGBDBM81448(CAS_5560-72-5 | IPRINDOLE | NSC_21722)
Affinity DataKi:  120nM
In DepthDetails ArticlePubMed
Target5-hydroxytryptamine receptor 2C(Rattus norvegicus (Rat))
University of Turku
Curated by PDSP Ki Database
LigandPNGBDBM81448(CAS_5560-72-5 | IPRINDOLE | NSC_21722)
Affinity DataKi:  206nM
In DepthDetails ArticlePubMed
Target5-hydroxytryptamine receptor 2A(Rattus norvegicus (rat))
University of Turku
Curated by PDSP Ki Database
LigandPNGBDBM81448(CAS_5560-72-5 | IPRINDOLE | NSC_21722)
Affinity DataKi:  217nM
In DepthDetails ArticlePubMed
TargetSodium-dependent serotonin transporter(Rattus norvegicus (rat))
University of Turku
Curated by PDSP Ki Database
LigandPNGBDBM81448(CAS_5560-72-5 | IPRINDOLE | NSC_21722)
Affinity DataKi:  1.00E+3nM
In DepthDetails ArticlePubMed
TargetSodium-dependent noradrenaline transporter(Homo sapiens (Human))
Mayo Clinic
Curated by PDSP Ki Database
LigandPNGBDBM81448(CAS_5560-72-5 | IPRINDOLE | NSC_21722)
Affinity DataKi:  1.26E+3nM
In DepthDetails ArticlePubMed
TargetSodium-dependent serotonin transporter(Homo sapiens (Human))
Mayo Clinic
Curated by PDSP Ki Database
LigandPNGBDBM81448(CAS_5560-72-5 | IPRINDOLE | NSC_21722)
Affinity DataKi:  1.62E+3nM
In DepthDetails ArticlePubMed
TargetSodium-dependent dopamine transporter(Homo sapiens (Human))
Mayo Clinic
Curated by PDSP Ki Database
LigandPNGBDBM81448(CAS_5560-72-5 | IPRINDOLE | NSC_21722)
Affinity DataKi:  6.53E+3nM
In DepthDetails ArticlePubMed
TargetBeta-2 adrenergic receptor(Homo sapiens (Human))
TBA
Curated by PDSP Ki Database
LigandPNGBDBM81448(CAS_5560-72-5 | IPRINDOLE | NSC_21722)
Affinity DataKi: >1.00E+4nM
In DepthDetails PubMed
LigandPNGBDBM81448(CAS_5560-72-5 | IPRINDOLE | NSC_21722)
Affinity DataKi: >1.00E+4nM
In DepthDetails ArticlePubMed