BDBM81628 MurF inhibitor, 12
SMILES CCN(CC)S(=O)(=O)c1ccc(Cl)c(c1)C(=O)Nc1sccc1C#N
InChI Key InChIKey=JPSODXBYRKZRKC-UHFFFAOYSA-N
Data  2 IC50
  Tab Delimited (TSV)   2D SDfile   Computed 3D by Vconf -m prep SDfile
Find this compound or compounds like it in BindingDB:
Activity Spreadsheet -- Enzyme Inhibition Constant Data from BindingDB
Found 2 hits for monomerid = 81628
TargetUDP-N-acetylmuramoyl-tripeptide--D-alanyl-D-alanine ligase(Streptococcus pneumoniae (Firmicutes))
University Of Jordan
Curated by ChEMBL
LigandPNGBDBM81628(MurF inhibitor, 12)
Affinity DataIC50:  1.51E+5nM. Assay description: Inhibition of Streptococcus pneumoniae MurF
In DepthDetails ArticlePubMed
TargetUDP-N-acetylmuramoyl-tripeptide--D-alanyl-D-alanine ligase(Streptococcus pneumoniae (Firmicutes))
University Of Jordan
Curated by ChEMBL
LigandPNGBDBM81628(MurF inhibitor, 12)
Affinity DataIC50:  1.51E+5nM. Assay description: Inhibition of D-Ala-D-Ala adding enzyme (MurF) from Streptococcus pneumoniase.
In DepthDetails ArticlePubMed