BDBM82205 Substrate analogue, 29
SMILES O=C(CCN(=O)=O)CNC(=O)CCN(=O)=O
InChI Key InChIKey=WQTRHRSRIDYXES-UHFFFAOYSA-N
Data  1 KI
  Tab Delimited (TSV)   2D SDfile   Computed 3D by Vconf -m prep SDfile
Find this compound or compounds like it in BindingDB:
Activity Spreadsheet -- Enzyme Inhibition Constant Data from BindingDB
Found 1 hit for monomerid = 82205
TargetDelta-aminolevulinic acid dehydratase(Escherichia coli)
University of NeuchÂTel
LigandPNGBDBM82205(Substrate analogue, 29)
Affinity DataKi:  3.00E+4nM ΔG°:  -6.41kcal/molepH: 8.1 T: 2°C. Assay description: The PBGS assay is a colorimetric assay based on the reaction between PBG and 4-dimethylaminobenzaldehyde (Ehrlich's reagent).
Ligand InfoKEGGPC cidPC sid
In DepthDetails ArticlePubMed