BDBM84586 Thioxothiazolidinone derivative, 7
SMILES COc1cccc(c1)N1C(=S)S\C(=C/c2cc(OC)c(O)c(c2)N(=O)=O)C1=O
InChI Key InChIKey=RYBGJLUADOQJRZ-NVNXTCNLSA-N
Data  1 IC50
  Tab Delimited (TSV)   2D SDfile   Computed 3D by Vconf -m prep SDfile
Find this compound or compounds like it in BindingDB:
Activity Spreadsheet -- Enzyme Inhibition Constant Data from BindingDB
Found 1 hit for monomerid = 84586
TargetTyrosine-protein phosphatase non-receptor type 1(Homo sapiens (Human))
Mcgill University
LigandPNGBDBM84586(Thioxothiazolidinone derivative, 7)
Affinity DataIC50:  1.60E+4nMT: 2°C. Assay description: PTP assay were conducted at 25 C in 96-well plates. Reaction rates were determined using a Variokan plate reader from Thermo Electron. For assay pH...
In DepthDetails ArticlePubMed