BDBM84591 Thioxothiazolidinone derivative, 12
SMILES COc1cc(\C=C2/SC(=S)N(C2=O)c2ccc(Cl)c(Cl)c2)cc(c1O)N(=O)=O
InChI Key InChIKey=HDKKYHKRLXLXTL-NSIKDUERSA-N
Data  1 IC50
  Tab Delimited (TSV)   2D SDfile   Computed 3D by Vconf -m prep SDfile
Find this compound or compounds like it in BindingDB:
Activity Spreadsheet -- Enzyme Inhibition Constant Data from BindingDB
Found 1 hit for monomerid = 84591
TargetTyrosine-protein phosphatase non-receptor type 1(Homo sapiens (Human))
Mcgill University
LigandPNGBDBM84591(Thioxothiazolidinone derivative, 12)
Affinity DataIC50:  7.00E+3nMT: 2°C. Assay description: PTP assay were conducted at 25 C in 96-well plates. Reaction rates were determined using a Variokan plate reader from Thermo Electron. For assay pH...
In DepthDetails ArticlePubMed