BDBM84685 1-Subsituted 1H-imidazole, 22
SMILES N#CCCCCn1ccnc1
InChI Key InChIKey=UWYSWUJVKIMZTJ-UHFFFAOYSA-N
Data  2 IC50
  Tab Delimited (TSV)   2D SDfile   Computed 3D by Vconf -m prep SDfile
Find this compound or compounds like it in BindingDB:
Activity Spreadsheet -- Enzyme Inhibition Constant Data from BindingDB
Found 2 hits for monomerid = 84685
TargetCytochrome P450 2A13(Homo sapiens (Human))
University of Basel
LigandPNGBDBM84685(1-Subsituted 1H-imidazole, 22)
Affinity DataIC50:  1.91E+4nMpH: 7.6 T: 2°C. Assay description: Inhibition assay using cytochrome P450 enzyme CYP2A6 and CYP2A13.
In DepthDetails ArticlePubMed
TargetCytochrome P450 2A6(Homo sapiens (Human))
University of Basel
LigandPNGBDBM84685(1-Subsituted 1H-imidazole, 22)
Affinity DataIC50:  2.24E+4nMpH: 7.6 T: 2°C. Assay description: Inhibition assay using cytochrome P450 enzyme CYP2A6 and CYP2A13.
In DepthDetails ArticlePubMed