BDBM84686 2-Subsituted 1H-imidazole, 23
SMILES CC(C)=CCC\C(C)=C\Cc1ncc[nH]1
InChI Key InChIKey=ILOXEPYJYBNBIU-KPKJPENVSA-N
Data  2 IC50
  Tab Delimited (TSV)   2D SDfile   Computed 3D by Vconf -m prep SDfile
Find this compound or compounds like it in BindingDB:
Activity Spreadsheet -- Enzyme Inhibition Constant Data from BindingDB
Found 2 hits for monomerid = 84686
TargetCytochrome P450 2A13(Homo sapiens (Human))
University of Basel
LigandPNGBDBM84686(2-Subsituted 1H-imidazole, 23)
Affinity DataIC50:  1.07E+4nMpH: 7.6 T: 2°C. Assay description: Inhibition assay using cytochrome P450 enzyme CYP2A6 and CYP2A13.
Ligand InfoPC cidPC sid
In DepthDetails ArticlePubMed
TargetCytochrome P450 2A6(Homo sapiens (Human))
University of Basel
LigandPNGBDBM84686(2-Subsituted 1H-imidazole, 23)
Affinity DataIC50: >3.00E+5nMpH: 7.6 T: 2°C. Assay description: Inhibition assay using cytochrome P450 enzyme CYP2A6 and CYP2A13.
Ligand InfoPC cidPC sid
In DepthDetails ArticlePubMed