BDBM84999 PYY,[leu31,Pro34], human
SMILES CCC(C)[C@H](NC(=O)[C@@H]1CCCN1C(=O)[C@@H](N)Cc1ccc(O)cc1)C(=O)N[C@@H](CCCCN)C(=O)N1CCC[C@H]1C(=O)N[C@@H](CCC(O)=O)C(=O)N[C@@H](C)C(=O)N1CCC[C@H]1C(=O)NCC(=O)N[C@@H](CCC(O)=O)C(=O)N[C@@H](CC(O)=O)C(=O)N[C@@H](C)C(=O)N[C@@H](CO)C(=O)N1CCC[C@H]1C(=O)N[C@@H](CCC(O)=O)C(=O)N[C@@H](CCC(O)=O)C(=O)N[C@@H](CC(C)C)C(=O)N[C@@H](CC(N)=O)C(=O)N[C@@H](CCCN=C(N)N)C(=O)N[C@@H](Cc1ccc(O)cc1)C(=O)N[C@@H](Cc1ccc(O)cc1)C(=O)N[C@@H](C)C(=O)N[C@@H](CO)C(=O)N[C@@H](CC(C)C)C(=O)N[C@@H](CCCN=C(N)N)C(=O)N[C@@H](Cc1c[nH]cn1)C(=O)N[C@@H](Cc1ccc(O)cc1)C(=O)N[C@@H](CC(C)C)C(=O)N[C@@H](CC(N)=O)C(=O)N[C@@H](CC(C)C)C(=O)N[C@@H](CC(C)C)C(=O)N[C@@H]([C@@H](C)O)C(=O)N[C@@H](CCCN=C(N)N)C(=O)N1CCC[C@H]1C(=O)N[C@@H](CCCN=C(N)N)C(=O)N[C@@H](Cc1ccc(O)cc1)C(O)=O
InChI Key InChIKey=OTMLEAMOFZEELI-GRLJOIPZSA-N
Data  8 KI
  Tab Delimited (TSV)   2D SDfile   Computed 3D by Vconf -m prep SDfile
Find this compound or compounds like it in BindingDB:
Activity Spreadsheet -- Enzyme Inhibition Constant Data from BindingDB
Found 5 hits for monomerid = 84999
TargetNeuropeptide Y receptor type 1(GUINEA PIG)
Uppsala University
Curated by PDSP Ki Database
LigandPNGBDBM84999(PYY,[leu31,Pro34], human)
Affinity DataKi:  0.0350nM
In DepthDetails ArticlePubMed
TargetNeuropeptide Y receptor type 1(RAT)
Uppsala University
Curated by PDSP Ki Database
LigandPNGBDBM84999(PYY,[leu31,Pro34], human)
Affinity DataKi:  0.110nM
In DepthDetails ArticlePubMed
TargetNeuropeptide Y receptor type 4(RAT)
Uppsala University
Curated by PDSP Ki Database
LigandPNGBDBM84999(PYY,[leu31,Pro34], human)
Affinity DataKi:  0.620nM
In DepthDetails ArticlePubMed
TargetNeuropeptide Y receptor type 4(Homo sapiens (Human))
Uppsala University
Curated by PDSP Ki Database
LigandPNGBDBM84999(PYY,[leu31,Pro34], human)
Affinity DataKi:  11nM
In DepthDetails ArticlePubMed
TargetPancreatic polypeptide receptor 1(GUINEA PIG)
Uppsala University
Curated by PDSP Ki Database
LigandPNGBDBM84999(PYY,[leu31,Pro34], human)
Affinity DataKi:  16nM
In DepthDetails ArticlePubMed