BDBM85401 GT 2140
SMILES N[C@@H](CC1CCCCC1)C(=O)NCCc1cnc[nH]1
InChI Key InChIKey=QPMVUDLKWHDHJI-ZDUSSCGKSA-N
Data  1 KI
  Tab Delimited (TSV)   2D SDfile   Computed 3D by Vconf -m prep SDfile
Find this compound or compounds like it in BindingDB:
Activity Spreadsheet -- Enzyme Inhibition Constant Data from BindingDB
Found 1 hit for monomerid = 85401
TargetHrh3 protein(RAT)
Gliatech
Curated by PDSP Ki Database
LigandPNGBDBM85401(GT 2140)
Affinity DataKi:  31nM
In DepthDetails PubMed