BDBM86668 HS378
SMILES CCO[C@]12Cc3c(nc4ccccc34)[C@]3(C)Oc4c5c(CC1N(CC1CC1)CCC235)ccc4O
InChI Key
Data  1 KI
  Tab Delimited (TSV)   2D SDfile   Computed 3D by Vconf -m prep SDfile
Find this compound or compounds like it in BindingDB:
Activity Spreadsheet -- Enzyme Inhibition Constant Data from BindingDB
Found 1 hit for monomerid = 86668
TargetDelta-type opioid receptor(Homo sapiens (Human))
I.G.B.M.C.
Curated by PDSP Ki Database
LigandPNGBDBM86668(HS378)
Affinity DataKi:  0.400nM
In DepthDetails ArticlePubMed