BDBM86840 (R)-6-bromo-2-(pyrrolidin-2-ylmethyl)-1H-pyrrolo[2,3-b]pyridine::CAS_24758167::NSC_24758167
SMILES Brc1ccc2cc(CC3CCCN3)[nH]c2n1
InChI Key InChIKey=OCFYPBCFRVXYMC-UHFFFAOYSA-N
Data  1 KI
  Tab Delimited (TSV)   2D SDfile   Computed 3D by Vconf -m prep SDfile
Find this compound or compounds like it in BindingDB:
Activity Spreadsheet -- Enzyme Inhibition Constant Data from BindingDB
Found 1 hit for monomerid = 86840
TargetNeuronal acetylcholine receptor subunit alpha-4(Rattus norvegicus (Rat))
Solvay Pharmaceuticals
Curated by PDSP Ki Database
LigandPNGBDBM86840((R)-6-bromo-2-(pyrrolidin-2-ylmethyl)-1H-pyrrolo[2...)
Affinity DataKi:  691nM
In DepthDetails ArticlePubMed