BDBM86986 (6-fluoro-2,2-diphenylbenzo[d][1,3]dioxol-5-yl)(piperidin-1-yl)methanone::CAS_10024106::NSC_10024106
SMILES Fc1cc2OC(Oc2cc1C(=O)N1CCCCC1)(c1ccccc1)c1ccccc1
InChI Key InChIKey=XTESHPWNXCEONX-UHFFFAOYSA-N
Data  1 KI
  Tab Delimited (TSV)   2D SDfile   Computed 3D by Vconf -m prep SDfile
Find this compound or compounds like it in BindingDB:
Activity Spreadsheet -- Enzyme Inhibition Constant Data from BindingDB
Found 1 hit for monomerid = 86986
TargetCannabinoid receptor 1(Homo sapiens (Human))
F. Hoffmann-La Roche
Curated by PDSP Ki Database
LigandPNGBDBM86986((6-fluoro-2,2-diphenylbenzo[d][1,3]dioxol-5-yl)(pi...)
Affinity DataKi:  11nM
In DepthDetails ArticlePubMed