BDBM9034 1H-Indole-3-carboxylic Acid [8-(6-Chloro-1,2,3,4-tetrahydroacridin-9-ylamino)octyl]amide::Indole-Tacrine Heterodimer 17::N-{8-[(6-chloro-1,2,3,4-tetrahydroacridin-9-yl)amino]octyl}-1H-indole-3-carboxamide
SMILES Clc1ccc2c(NCCCCCCCCNC(=O)c3c[nH]c4ccccc34)c3CCCCc3nc2c1
InChI Key InChIKey=NTWXQLUPCDPUOH-UHFFFAOYSA-N
Data  3 IC50
  Tab Delimited (TSV)   2D SDfile   Computed 3D by Vconf -m prep SDfile
Find this compound or compounds like it in BindingDB:
Activity Spreadsheet -- Enzyme Inhibition Constant Data from BindingDB
Found 2 hits for monomerid = 9034
TargetAcetylcholinesterase(Bos taurus (bovine))
Neuropharma
LigandPNGBDBM9034(1H-Indole-3-carboxylic Acid [8-(6-Chloro-1,2,3,4-t...)
Affinity DataIC50:  46nMpH: 8.0 T: 2°C. Assay description: The cholinesterase assays were performed using colorimetric method reported by Ellman. The absorbance changes at 405 nm were recorded for 5 min with ...
In DepthDetails ArticlePubMed
TargetCholinesterase(Homo sapiens (Human))
Neuropharma
LigandPNGBDBM9034(1H-Indole-3-carboxylic Acid [8-(6-Chloro-1,2,3,4-t...)
Affinity DataIC50:  22.4nM. Assay description: The cholinesterase assays were performed using colorimetric method reported by Ellman. The absorbance changes at 405 nm were recorded for 5 min with ...
In DepthDetails ArticlePubMed