BDBM92337 Ro20-1724
SMILES CCCOc1cc(CC2CNC(=O)N2)ccc1OC
InChI Key InChIKey=PMTHVGDMNMTSTC-UHFFFAOYSA-N
Data  2 IC50
  Tab Delimited (TSV)   2D SDfile   Computed 3D by Vconf -m prep SDfile
Find this compound or compounds like it in BindingDB:
Activity Spreadsheet -- Enzyme Inhibition Constant Data from BindingDB
Found 2 hits for monomerid = 92337
TargetcAMP-specific 3',5'-cyclic phosphodiesterase 4D(Homo sapiens (Human))
University of North Carolina
LigandPNGBDBM92337(Ro20-1724)
Affinity DataIC50:  2.00E+3nMpH: 7.5 T: 2°C. Assay description: Enzymatic activities were assayed using [3H] cAMP and [3H]cGMP as substrate.
In DepthDetails ArticlePubMed
TargetPhosphodiesterase(Trypanosoma cruzi)
University of North Carolina
LigandPNGBDBM92337(Ro20-1724)
Affinity DataIC50: >1.00E+5nMpH: 7.5 T: 2°C. Assay description: Enzymatic activities were assayed using [3H] cAMP and [3H]cGMP as substrate.
In DepthDetails ArticlePubMed