BDBM9265 3-hydroxy-N-[(1S)-1-((1R)-1-hydroxy-2-{isobutyl[(4-methoxyphenyl)sulfonyl]amino}ethyl)hept-6-enyl]-2-(pent-4-enyloxy)benzamide::3-hydroxy-N-[(2R,3S)-2-hydroxy-1-[(4-methoxybenzene)(2-methylpropyl)sulfonamido]non-8-en-3-yl]-2-(pent-4-en-1-yloxy)benzamide::acyclic inhibitor 21
SMILES COc1ccc(cc1)S(=O)(=O)N(CC(C)C)C[C@@H](O)[C@H](CCCCC=C)NC(=O)c1cccc(O)c1OCCCC=C
InChI Key InChIKey=PZQYHDLWEHJYEA-MFMCTBQISA-N
Data  1 KI
  Tab Delimited (TSV)   2D SDfile   Computed 3D by Vconf -m prep SDfile
Find this compound or compounds like it in BindingDB:
Activity Spreadsheet -- Enzyme Inhibition Constant Data from BindingDB
Found 1 hit for monomerid = 9265
TargetDimer of Gag-Pol polyprotein [501-599,Q508K,L534I,L564I,C568A,C596A](Human immunodeficiency virus type 1)
University of Illinois At Chicago
LigandPNGBDBM9265(3-hydroxy-N-[(1S)-1-((1R)-1-hydroxy-2-{isobutyl[(4...)
Affinity DataKi:  9nM ΔG°:  -11.0kcal/molepH: 6.4 T: 2°C. Assay description: The Ki values were determined using fluorogenic substrate, 2-(aminobenzoyl)-Thr-Ile-Nle-Phe(p-NO2)-Gln-ArgNH2. A standard curve relating changes in f...
In DepthDetails ArticlePubMed