BDBM9266 (2R)-2-hydroxy-2-[(11S)-17-hydroxy-13-oxo-2,3,4,5,6,7,8,9,10,11,12,13-dodecahydro-1,12-benzoxazacyclopentadecin-11-yl]-N-(4-methoxyphenyl)-N-(2-methylpropyl)ethane-1-sulfonamido::Cycloamide 27::N-{(2R)-2-hydroxy-2-[(11S)-17-hydroxy-13-oxo-2,3,4,5,6,7,8,9,10,11,12,13-dodecahydro-1,12-benzoxazacyclopentadecin-11-yl]ethyl}-N-isobutyl-4-methoxybenzenesulfonamide
SMILES COc1ccc(cc1)S(=O)(=O)N(CC(C)C)C[C@@H](O)[C@@H]1CCCCCCCCCOc2c(O)cccc2C(=O)N1
InChI Key InChIKey=XAJNFGMYCCUBDT-XTEPFMGCSA-N
Data  1 KI
  Tab Delimited (TSV)   2D SDfile   Computed 3D by Vconf -m prep SDfile
Find this compound or compounds like it in BindingDB:
Activity Spreadsheet -- Enzyme Inhibition Constant Data from BindingDB
Found 1 hit for monomerid = 9266
TargetDimer of Gag-Pol polyprotein [501-599,Q508K,L534I,L564I,C568A,C596A](Human immunodeficiency virus type 1)
University of Illinois At Chicago
LigandPNGBDBM9266((2R)-2-hydroxy-2-[(11S)-17-hydroxy-13-oxo-2,3,4,5,...)
Affinity DataKi:  2nM ΔG°:  -11.9kcal/molepH: 6.4 T: 2°C. Assay description: The Ki values were determined using fluorogenic substrate, 2-(aminobenzoyl)-Thr-Ile-Nle-Phe(p-NO2)-Gln-ArgNH2. A standard curve relating changes in f...
In DepthDetails ArticlePubMed