BDBM92689 5-Methoxyu-L-tryptophan, 11
SMILES COc1ccc2[nH]cc(CC([NH3+])C([O-])=O)c2c1
InChI Key InChIKey=KVNPSKDDJARYKK-UHFFFAOYSA-N
Data  1 Kd
  Tab Delimited (TSV)   2D SDfile   Computed 3D by Vconf -m prep SDfile
Find this compound or compounds like it in BindingDB:
Activity Spreadsheet -- Enzyme Inhibition Constant Data from BindingDB
Found 1 hit for monomerid = 92689
TargetTrp operon repressor(Escherichia coli (strain K12))
University of Chicago
LigandPNGBDBM92689(5-Methoxyu-L-tryptophan, 11)
Affinity DataKd:  3.07E+4nM. Assay description: Binding assay of L-trptophan and analogues to trp aporepressor
In DepthDetails PubMed