BDBM92691 L-Indole-3-lactic acid, 13
SMILES OC(Cc1c[nH]c2ccccc12)C([O-])=O
InChI Key InChIKey=XGILAAMKEQUXLS-UHFFFAOYSA-M
Data  1 Kd
  Tab Delimited (TSV)   2D SDfile   Computed 3D by Vconf -m prep SDfile
Find this compound or compounds like it in BindingDB:
Activity Spreadsheet -- Enzyme Inhibition Constant Data from BindingDB
Found 1 hit for monomerid = 92691
TargetTrp operon repressor(Escherichia coli (strain K12))
University of Chicago
LigandPNGBDBM92691(L-Indole-3-lactic acid, 13)
Affinity DataKd:  3.52E+4nM. Assay description: Binding assay of L-trptophan and analogues to trp aporepressor
In DepthDetails PubMed