BDBM92692 L-Tryptophan methyl ester, 14
SMILES COC(=O)C(N)Cc1c[nH]c2ccccc12
InChI Key InChIKey=KCUNTYMNJVXYKZ-UHFFFAOYSA-N
Data  1 Kd
PDB links: 1 PDB ID matches this monomer.
  Tab Delimited (TSV)   2D SDfile   Computed 3D by Vconf -m prep SDfile
Find this compound or compounds like it in BindingDB:
Activity Spreadsheet -- Enzyme Inhibition Constant Data from BindingDB
Found 1 hit for monomerid = 92692
TargetTrp operon repressor(Escherichia coli (strain K12))
University of Chicago
LigandPNGBDBM92692(L-Tryptophan methyl ester, 14)
Affinity DataKd:  3.71E+4nM. Assay description: Binding assay of L-trptophan and analogues to trp aporepressor
In DepthDetails PubMed