BDBM92700 5-Hydroxy-L-tryptophan, 22
SMILES [NH3+]C(Cc1c[nH]c2ccc(O)cc12)C([O-])=O
InChI Key InChIKey=LDCYZAJDBXYCGN-UHFFFAOYSA-N
Data  1 Kd
  Tab Delimited (TSV)   2D SDfile   Computed 3D by Vconf -m prep SDfile
Find this compound or compounds like it in BindingDB:
Activity Spreadsheet -- Enzyme Inhibition Constant Data from BindingDB
Found 1 hit for monomerid = 92700
TargetTrp operon repressor(Escherichia coli (strain K12))
University of Chicago
LigandPNGBDBM92700(5-Hydroxy-L-tryptophan, 22)
Affinity DataKd:  2.84E+6nM. Assay description: Binding assay of L-trptophan and analogues to trp aporepressor
In DepthDetails PubMed