BDBM92996 3-Aminoglutarate
SMILES NC(CC(O)=O)CC(O)=O
InChI Key InChIKey=BBJIPMIXTXKYLZ-UHFFFAOYSA-N
Data  1 KI
PDB links: 20 PDB IDs match this monomer.
  Tab Delimited (TSV)   2D SDfile   Computed 3D by Vconf -m prep SDfile
Find this compound or compounds like it in BindingDB:
Activity Spreadsheet -- Enzyme Inhibition Constant Data from BindingDB
Found 1 hit for monomerid = 92996
TargetBifunctional aspartokinase/homoserine dehydrogenase 1(Escherichia coli)
University of Akron
LigandPNGBDBM92996(3-Aminoglutarate)
Affinity DataKi:  4.50E+7nM. Assay description: Analogues of L-aspartic acid and beta-aspartyl phosphate were examined as inhibitors in the aspartokinase I reaction by using the coupled reaction wi...
In DepthDetails ArticlePubMed