BDBM92999 Homoserine phosphate
SMILES N[C@@H](CCOP(O)(O)=O)C([O-])=O
InChI Key InChIKey=FXDNYOANAXWZHG-VKHMYHEASA-M
Data  1 KI
  Tab Delimited (TSV)   2D SDfile   Computed 3D by Vconf -m prep SDfile
Find this compound or compounds like it in BindingDB:
Activity Spreadsheet -- Enzyme Inhibition Constant Data from BindingDB
Found 1 hit for monomerid = 92999
TargetBifunctional aspartokinase/homoserine dehydrogenase 1(Escherichia coli)
University of Akron
LigandPNGBDBM92999(Homoserine phosphate)
Affinity DataKi:  6.00E+6nM. Assay description: Analogues of L-aspartic acid and beta-aspartyl phosphate were examined as inhibitors in the aspartokinase I reaction by using the coupled reaction wi...
In DepthDetails ArticlePubMed