BDBM93079 ACS No 165
SMILES NC(CCCNc1ccc(cc1N(=O)=O)[N+]([O-])=O)CC([O-])=O
InChI Key InChIKey=OFKKEEHBQICORT-UHFFFAOYSA-M
Data  1 KI
  Tab Delimited (TSV)   2D SDfile   Computed 3D by Vconf -m prep SDfile
Find this compound or compounds like it in BindingDB:
Activity Spreadsheet -- Enzyme Inhibition Constant Data from BindingDB
Found 1 hit for monomerid = 93079
TargetAnthranilate phosphoribosyltransferase(Mycobacterium tuberculosis)
University of Auckland
LigandPNGBDBM93079(ACS No 165)
Affinity DataKi:  7.90E+4nM. Assay description: The initial screen was performed in a 96-well plate using the fluoresence-based assay previously described. An enzyme-coupled absorbance-based assay...
In DepthDetails ArticlePubMed