BDBM93326 Carbamate {3,19}, 2
SMILES Fc1cccc(c1)C1CCC[C@@H](N1CS(=O)(=O)c1ccc(F)c(F)c1)C1(CC1)OC(=O)NN1CCC(CC1)N1CCCC1
InChI Key InChIKey=FFFIYCXMLAWKCN-YPJJGMIRSA-N
Data  1 IC50
  Tab Delimited (TSV)   2D SDfile   Computed 3D by Vconf -m prep SDfile
Find this compound or compounds like it in BindingDB:
Activity Spreadsheet -- Enzyme Inhibition Constant Data from BindingDB
Found 1 hit for monomerid = 93326
TargetAmyloid-beta precursor protein(Homo sapiens (Human))
Schering-Plough Research Institute
LigandPNGBDBM93326(Carbamate {3,19}, 2)
Affinity DataIC50:  6.10nMpH: 7.0 T: 2°C. Assay description: Inhibition assay using gamma-secretase.
In DepthDetails ArticlePubMed