BDBM93466 1-(4-fluoranyl-3-nitro-phenyl)sulfonylazepane::1-(4-fluoro-3-nitro-phenyl)sulfonylazepane::1-(4-fluoro-3-nitrophenyl)sulfonylazepane::1-[(4-fluoro-3-nitrophenyl)sulfonyl]azepane::MLS000586596::SMR000207975::cid_12005640
SMILES [O-][N+](=O)c1cc(ccc1F)S(=O)(=O)N1CCCCCC1
InChI Key InChIKey=XIBSMTOTQYNEMM-UHFFFAOYSA-N
Data  2 IC50
  Tab Delimited (TSV)   2D SDfile   Computed 3D by Vconf -m prep SDfile
Find this compound or compounds like it in BindingDB:
Activity Spreadsheet -- Enzyme Inhibition Constant Data from BindingDB
Found 2 hits for monomerid = 93466
TargetReceptor-interacting serine/threonine-protein kinase 2(Homo sapiens (Human))
The Scripps Research Institute Molecular Screening Center
Curated by PubChem BioAssay
LigandPNGBDBM93466(1-(4-fluoranyl-3-nitro-phenyl)sulfonylazepane | 1-...)
Affinity DataIC50:  1.53E+3nM
Ligand InfoPC cidPC sid
In DepthDetails PCBioAssay
TargetBeta-lactamase(Pseudomonas aeruginosa)
The Scripps Research Institute Molecular Screening Center
Curated by PubChem BioAssay
LigandPNGBDBM93466(1-(4-fluoranyl-3-nitro-phenyl)sulfonylazepane | 1-...)
Affinity DataIC50: >4.98E+4nM
Ligand InfoPC cidPC sid
In DepthDetails PCBioAssay