BDBM96535 2-methyl-1-[(E)-1-oxo-4-phenylbut-3-enyl]-N-[[2-(trifluoromethyl)phenyl]methylsulfonyl]-2-azetidinecarboxamide::2-methyl-1-[(E)-4-phenylbut-3-enoyl]-N-[2-(trifluoromethyl)benzyl]sulfonyl-azetidine-2-carboxamide::2-methyl-1-[(E)-4-phenylbut-3-enoyl]-N-[[2-(trifluoromethyl)phenyl]methylsulfonyl]azetidine-2-carboxamide::MLS003118398::SMR001282062::cid_49786388
SMILES CC1(CCN1C(=O)C\C=C\c1ccccc1)C(=O)NS(=O)(=O)Cc1ccccc1C(F)(F)F
InChI Key InChIKey=JFHWBBWKLXKONS-JXMROGBWSA-N
Data  1 IC50
  Tab Delimited (TSV)   2D SDfile   Computed 3D by Vconf -m prep SDfile
Find this compound or compounds like it in BindingDB:
Activity Spreadsheet -- Enzyme Inhibition Constant Data from BindingDB
Found 1 hit for monomerid = 96535
TargetHuntingtin(Homo sapiens (Human))
The Scripps Research Institute Molecular Screening Center
Curated by PubChem BioAssay
LigandPNGBDBM96535(2-methyl-1-[(E)-1-oxo-4-phenylbut-3-enyl]-N-[[2-(t...)
Affinity DataIC50:  3.07E+3nM
Ligand InfoPC cidPC sid
In DepthDetails PCBioAssay