BDBM97506 Roche-Dataset for PDE10A, Compound 18::US8470820, 17
SMILES O=C(Nc1cc(nn1CCc1ccccc1)-c1ccccn1)c1nc(ccc1Nc1cncnc1)C1CC1
InChI Key InChIKey=HYYUXPCLEWIGTO-UHFFFAOYSA-N
Data  2 IC50
  Tab Delimited (TSV)   2D SDfile   Computed 3D by Vconf -m prep SDfile
Find this compound or compounds like it in BindingDB:
Activity Spreadsheet -- Enzyme Inhibition Constant Data from BindingDB
Found 2 hits for monomerid = 97506
TargetcAMP and cAMP-inhibited cGMP 3',5'-cyclic phosphodiesterase 10A(Homo sapiens (Human))
F. Hoffmann-La Roche
LigandPNGBDBM97506(Roche-Dataset for PDE10A, Compound 18 | US8470820,...)
Affinity DataIC50:  4.91nM. Assay description: Human PDE10A IC50 values were determined by using purified enzyme (Biomol cat. # SE-534) in a scintillation proximity assay (SPA) in 96 well plates (...
In DepthDetails ArticlePubMed
TargetcAMP and cAMP-inhibited cGMP 3',5'-cyclic phosphodiesterase 10A(Homo sapiens (Human))
F. Hoffmann-La Roche
LigandPNGBDBM97506(Roche-Dataset for PDE10A, Compound 18 | US8470820,...)
Affinity DataIC50:  5nMpH: 7.5Assay Description:Scintillation proximity assay using human PDE10A.
In DepthDetails US Patent