BDBM97549 US8470820, 60
SMILES Cn1nc(cc1NC(=O)c1nc(ncc1Nc1cncnc1)C1CCCCC1)-c1ccccn1
InChI Key InChIKey=FPBMZAIGBMRUEY-UHFFFAOYSA-N
Data  1 IC50
  Tab Delimited (TSV)   2D SDfile   Computed 3D by Vconf -m prep SDfile
Find this compound or compounds like it in BindingDB:
Activity Spreadsheet -- Enzyme Inhibition Constant Data from BindingDB
Found 1 hit for monomerid = 97549
TargetcAMP and cAMP-inhibited cGMP 3',5'-cyclic phosphodiesterase 10A(Homo sapiens (Human))
Hoffmann-La Roche
US Patent
LigandPNGBDBM97549(US8470820, 60)
Affinity DataIC50:  6nMpH: 7.5Assay Description:Scintillation proximity assay using human PDE10A.
In DepthDetails US Patent