BDBM97928 US8481536, 495
SMILES Cc1ccccc1-c1cc2nnc(Nc3ccc(cc3)S(=O)(=O)NCCN3CCCC3)nc2cc1OCCO
InChI Key InChIKey=JDIZCBKUDXSSKP-UHFFFAOYSA-N
Data  1 IC50
  Tab Delimited (TSV)   2D SDfile   Computed 3D by Vconf -m prep SDfile
Find this compound or compounds like it in BindingDB:
Activity Spreadsheet -- Enzyme Inhibition Constant Data from BindingDB
Found 1 hit for monomerid = 97928
TargetProto-oncogene tyrosine-protein kinase Src(Homo sapiens (Human))
Targegen
US Patent
LigandPNGBDBM97928(US8481536, 495)
Affinity DataIC50: >1.00E+4nMT: 2°C. Assay description: Testing of inhibition of kinases in vitro using luciferase-based assay from KinaseGlo, Promega Corp.
In DepthDetails US Patent