BDBM98044 2-amino-1-(2-diphenoxyphosphorylpyrrolidin-1-yl)ethanone::CHEMBL399189::Compound 10.4
SMILES NCC(=O)N1CCCC1P(=O)(Oc1ccccc1)Oc1ccccc1
InChI Key InChIKey=APORIKJNLVVUNX-UHFFFAOYSA-N
Data  5 IC50
  Tab Delimited (TSV)   2D SDfile   Computed 3D by Vconf -m prep SDfile
Find this compound or compounds like it in BindingDB:
Activity Spreadsheet -- Enzyme Inhibition Constant Data from BindingDB
Found 5 hits for monomerid = 98044
TargetDipeptidyl peptidase 4(Homo sapiens (Human))
University of Anterwerp
LigandPNGBDBM98044(2-amino-1-(2-diphenoxyphosphorylpyrrolidin-1-yl)et...)
Affinity DataIC50:  1.60E+4nMpH: 8.3 T: 2°C. Assay description: Inhibitory concentration of the compound against Dipeptidyl peptidase IV (DPP IV) in Homo sapiens (human)is measured
In DepthDetails ArticlePubMed
TargetDipeptidyl peptidase 2(Homo sapiens (Human))
University of Anterwerp
LigandPNGBDBM98044(2-amino-1-(2-diphenoxyphosphorylpyrrolidin-1-yl)et...)
Affinity DataIC50:  7.90E+4nMpH: 5.5 T: 2°C. Assay description: Inhibitory concentration of the compound against Dipeptidyl peptidase IV (DPP IV) in Homo sapiens (human)is measured
In DepthDetails ArticlePubMed
TargetDipeptidyl peptidase 2(Homo sapiens (Human))
University of Anterwerp
LigandPNGBDBM98044(2-amino-1-(2-diphenoxyphosphorylpyrrolidin-1-yl)et...)
Affinity DataIC50:  7.90E+4nM. Assay description: Inhibition of human DPP2
In DepthDetails ArticlePubMed
TargetDipeptidyl peptidase 8(Homo sapiens (Human))
University Of Antwerp
Curated by ChEMBL
LigandPNGBDBM98044(2-amino-1-(2-diphenoxyphosphorylpyrrolidin-1-yl)et...)
Affinity DataIC50:  2.50E+4nM. Assay description: Inhibition of human DPP8
In DepthDetails ArticlePubMed
TargetDipeptidyl peptidase 4(Homo sapiens (Human))
University of Anterwerp
LigandPNGBDBM98044(2-amino-1-(2-diphenoxyphosphorylpyrrolidin-1-yl)et...)
Affinity DataIC50:  1.60E+4nM. Assay description: Inhibition of human DPP4
In DepthDetails ArticlePubMed