BDBM98057 2-amino-N-(1-diphenoxyphosphorylethyl)acetamide::Compound 9.7
SMILES CC(NC(=O)CN)P(=O)(Oc1ccccc1)Oc1ccccc1
InChI Key InChIKey=RVHKUTDLPVBBEE-UHFFFAOYSA-N
Data  2 IC50
  Tab Delimited (TSV)   2D SDfile   Computed 3D by Vconf -m prep SDfile
Find this compound or compounds like it in BindingDB:
Activity Spreadsheet -- Enzyme Inhibition Constant Data from BindingDB
Found 2 hits for monomerid = 98057
TargetDipeptidyl peptidase 2(Homo sapiens (Human))
University of Anterwerp
LigandPNGBDBM98057(2-amino-N-(1-diphenoxyphosphorylethyl)acetamide | ...)
Affinity DataIC50: >1.00E+6nMpH: 5.5 T: 2°C. Assay description: Inhibitory concentration of the compound against Dipeptidyl peptidase IV (DPP IV) in Homo sapiens (human)is measured
In DepthDetails ArticlePubMed
TargetDipeptidyl peptidase 4(Homo sapiens (Human))
University of Anterwerp
LigandPNGBDBM98057(2-amino-N-(1-diphenoxyphosphorylethyl)acetamide | ...)
Affinity DataIC50: >5.00E+5nMpH: 8.3 T: 2°C. Assay description: Inhibitory concentration of the compound against Dipeptidyl peptidase IV (DPP IV) in Homo sapiens (human)is measured
In DepthDetails ArticlePubMed