BDBM99596 US8501936, 95
SMILES COc1ccc(Nc2nc3cccc(-c4ccc(CN5CCS(=O)(=O)CC5)cc4)n3n2)cc1
InChI Key InChIKey=GNYIGMZJKXOFTL-UHFFFAOYSA-N
Data  3 IC50
  Tab Delimited (TSV)   2D SDfile   Computed 3D by Vconf -m prep SDfile
Find this compound or compounds like it in BindingDB:
Activity Spreadsheet -- Enzyme Inhibition Constant Data from BindingDB
Found 3 hits for monomerid = 99596
TargetFocal adhesion kinase 1(Homo sapiens (Human))
Cephalon
US Patent
LigandPNGBDBM99596(US8501936, 95)
Affinity DataIC50:  2.00E+3nM. Assay description: The ability of compounds to inhibit the kinase activity of baculovirus-expressed human FAK and JAK kinase using the time-resolved fluorescence (TRF) ...
In DepthDetails US Patent
TargetTyrosine-protein kinase JAK3(Homo sapiens (Human))
Cephalon
US Patent
LigandPNGBDBM99596(US8501936, 95)
Affinity DataIC50:  25.3nM. Assay description: The ability of compounds to inhibit the kinase activity of baculovirus-expressed human FAK and JAK kinase using the time-resolved fluorescence (TRF) ...
In DepthDetails US Patent
TargetTyrosine-protein kinase JAK2(Homo sapiens (Human))
Cephalon
US Patent
LigandPNGBDBM99596(US8501936, 95)
Affinity DataIC50:  1nM. Assay description: The ability of compounds to inhibit the kinase activity of baculovirus-expressed human FAK and JAK kinase using the time-resolved fluorescence (TRF) ...
In DepthDetails US Patent