BDBM99685 US8501936, 186
SMILES CC(C)(C)OC(=O)N1CC[C@H]([C@@H](O)C1)c1cccc(Nc2nc3c(cccn3n2)-c2ccc(cc2)S(C)(=O)=O)c1
InChI Key InChIKey=XBHAPFBFXQNEGQ-ZCYQVOJMSA-N
Data  3 IC50
  Tab Delimited (TSV)   2D SDfile   Computed 3D by Vconf -m prep SDfile
Find this compound or compounds like it in BindingDB:
Activity Spreadsheet -- Enzyme Inhibition Constant Data from BindingDB
Found 3 hits for monomerid = 99685
TargetFocal adhesion kinase 1(Homo sapiens (Human))
Cephalon
US Patent
LigandPNGBDBM99685(US8501936, 186)
Affinity DataIC50:  2.99E+3nM. Assay description: The ability of compounds to inhibit the kinase activity of baculovirus-expressed human FAK and JAK kinase using the time-resolved fluorescence (TRF) ...
In DepthDetails US Patent
TargetTyrosine-protein kinase JAK3(Homo sapiens (Human))
Cephalon
US Patent
LigandPNGBDBM99685(US8501936, 186)
Affinity DataIC50:  71.1nM. Assay description: The ability of compounds to inhibit the kinase activity of baculovirus-expressed human FAK and JAK kinase using the time-resolved fluorescence (TRF) ...
In DepthDetails US Patent
TargetTyrosine-protein kinase JAK2(Homo sapiens (Human))
Cephalon
US Patent
LigandPNGBDBM99685(US8501936, 186)
Affinity DataIC50:  1.35nM. Assay description: The ability of compounds to inhibit the kinase activity of baculovirus-expressed human FAK and JAK kinase using the time-resolved fluorescence (TRF) ...
In DepthDetails US Patent