BDBM99710 US8501936, 212
SMILES CC(C)(C)OC(=O)N1CCC(CC1)n1cc(Nc2nc3c(cccn3n2)-c2ccc(cc2)S(C)(=O)=O)cn1
InChI Key InChIKey=RIMSDVSUOWUBJO-UHFFFAOYSA-N
Data  3 IC50
  Tab Delimited (TSV)   2D SDfile   Computed 3D by Vconf -m prep SDfile
Find this compound or compounds like it in BindingDB:
Activity Spreadsheet -- Enzyme Inhibition Constant Data from BindingDB
Found 3 hits for monomerid = 99710
TargetFocal adhesion kinase 1(Homo sapiens (Human))
Cephalon
US Patent
LigandPNGBDBM99710(US8501936, 212)
Affinity DataIC50:  3.00E+3nM. Assay description: The ability of compounds to inhibit the kinase activity of baculovirus-expressed human FAK and JAK kinase using the time-resolved fluorescence (TRF) ...
In DepthDetails US Patent
TargetTyrosine-protein kinase JAK3(Homo sapiens (Human))
Cephalon
US Patent
LigandPNGBDBM99710(US8501936, 212)
Affinity DataIC50:  20.9nM. Assay description: The ability of compounds to inhibit the kinase activity of baculovirus-expressed human FAK and JAK kinase using the time-resolved fluorescence (TRF) ...
In DepthDetails US Patent
TargetTyrosine-protein kinase JAK2(Homo sapiens (Human))
Cephalon
US Patent
LigandPNGBDBM99710(US8501936, 212)
Affinity DataIC50:  0.5nM. Assay description: The ability of compounds to inhibit the kinase activity of baculovirus-expressed human FAK and JAK kinase using the time-resolved fluorescence (TRF) ...
In DepthDetails US Patent