BDBM99892 US8501936, 411
SMILES CCN1CCP(=O)(CC1)c1ccc(Nc2nc3c(cccn3n2)-c2ccc(cc2)S(C)(=O)=O)cc1
InChI Key InChIKey=BFEMVAYKIVOLEV-UHFFFAOYSA-N
Data  3 IC50
  Tab Delimited (TSV)   2D SDfile   Computed 3D by Vconf -m prep SDfile
Find this compound or compounds like it in BindingDB:
Activity Spreadsheet -- Enzyme Inhibition Constant Data from BindingDB
Found 3 hits for monomerid = 99892
TargetFocal adhesion kinase 1(Homo sapiens (Human))
Cephalon
US Patent
LigandPNGBDBM99892(US8501936, 411)
Affinity DataIC50:  1.86E+3nM. Assay description: The ability of compounds to inhibit the kinase activity of baculovirus-expressed human FAK and JAK kinase using the time-resolved fluorescence (TRF) ...
Ligand InfoPC cidPC sid
In DepthDetails US Patent
TargetTyrosine-protein kinase JAK3(Homo sapiens (Human))
Cephalon
US Patent
LigandPNGBDBM99892(US8501936, 411)
Affinity DataIC50:  57.9nM. Assay description: The ability of compounds to inhibit the kinase activity of baculovirus-expressed human FAK and JAK kinase using the time-resolved fluorescence (TRF) ...
Ligand InfoPC cidPC sid
In DepthDetails US Patent
TargetTyrosine-protein kinase JAK2(Homo sapiens (Human))
Cephalon
US Patent
LigandPNGBDBM99892(US8501936, 411)
Affinity DataIC50:  1.62nM. Assay description: The ability of compounds to inhibit the kinase activity of baculovirus-expressed human FAK and JAK kinase using the time-resolved fluorescence (TRF) ...
Ligand InfoPC cidPC sid
In DepthDetails US Patent