Target
Nuclear factor NF-kappa-B p105 subunit
Ligand
BDBM527584
Substrate
Meas. Tech.
NF-keppaB Inhibitory Activity Evaluation Test
IC50
297±n/a nM
Citation
 Aono, HSeki, IImamura, MTanaka, TShirae, SKawashima, KYamazaki, YYamamoto, M 6H-thieno[2,3-e][1,2,4]triazolo[3,4-c][1,2,4]triazepine derivative US Patent  US11186588 Publication Date 11/30/2021 
Target
Name:
Nuclear factor NF-kappa-B p105 subunit
Synonyms:
NFKB1 Nuclear factor NF-kappa-B (NF-kB) Nuclear factor NF-kappa-B p105 subunit
Type:
Protein
Mol. Mass.:
105329.57
Organism:
Homo sapiens (Human)
Description:
P19838
Residue:
968
  
Inhibitor
Name:
BDBM527584
Synonyms:
US11186588, Example 48
Type:
Small organic molecule
Emp. Form.:
C23H21ClN6OS
Mol. Mass.:
464.97
SMILES:
COc1ccnc(CN2N=C(c3c(C)c(C)sc3-n3c(C)nnc23)c2ccc(Cl)cc2)c1
: