Target
Sigma non-opioid intracellular receptor 1
Ligand
BDBM50001000
Substrate
Meas. Tech.
Receptor Binding Assay
Ki
182±n/a nM
Citation
 Smith, RARideout, DCMyers, KJKawasaki, A Analogs of dextromethorphan with balanced receptor activities US Patent  US11535596 Publication Date 12/27/2022 
Target
Name:
Sigma non-opioid intracellular receptor 1
Synonyms:
Aging-associated gene 8 protein SGMR1_HUMAN SIGMAR1 SR31747-binding protein Sigma 1-type opioid receptor Sigma1R | hSigmaR1
Type:
Enzyme Catalytic Domain
Mol. Mass.:
25124.85
Organism:
Homo sapiens (Human)
Description:
Q99720
Residue:
223
  
Inhibitor
Name:
BDBM50001000
Synonyms:
CHEBI:29133 US11535596, Compound Dextorphan (DX)
Type:
Small organic molecule
Emp. Form.:
C17H23NO
Mol. Mass.:
257.3706
SMILES:
[H][C@]12Cc3ccc(O)cc3[C@@]3(CCCC[C@]13[H])CCN2C
: