Target
Sterol regulatory element-binding protein 2
Ligand
BDBM629718
Substrate
Meas. Tech.
In Vitro Assay-SREBP-2
IC50
125±n/a nM
Citation
 Feula, ASalituro, FGStites, RE STEROIDAL COMPOSITIONS AND METHODS OF TREATING LIPOGENIC CANCERS US Patent  US20230340011 Publication Date 10/26/2023 
Target
Name:
Sterol regulatory element-binding protein 2
Synonyms:
BHLHD2 SREBF2 | SREBP2
Type:
PROTEIN
Mol. Mass.:
123713.87
Organism:
Homo sapiens (Human)
Description:
ChEMBL_765690
Residue:
1141
  
Inhibitor
Name:
BDBM629718
Synonyms:
US20230340011, Example 10. | US20230340011, Example 12.
Type:
Small organic molecule
Emp. Form.:
C27H45NO3
Mol. Mass.:
431.6511
SMILES:
[H][C@@]1(CC[C@@]2([H])[C@]3([H])CC=C4C[C@@H](O)CC[C@]4(C)[C@@]3([H])CC[C@]12C)[C@H](C)CCC(=O)N(C)OCC
: